Reaction Details
TargetMAP/microtubule affinity-regulating kinase 4
LigandBDBM4814
Substrate/Competitorn/a
Meas. Tech.ChEMBL_655459 (CHEMBL1244503)
Kd 3600±n/a nM
Citation Zarrinkar, PPGunawardane, RNCramer, MDGardner, MFBrigham, DBelli, BKaraman, MWPratz, KWPallares, GChao, QSprankle, KGPatel, HKLevis, MArmstrong, RCJames, JBhagwat, SS AC220 is a uniquely potent and selective inhibitor of FLT3 for the treatment of acute myeloid leukemia (AML). Blood114:2984-92 (2009) 
 
MAP/microtubule affinity-regulating kinase 4
Name:MAP/microtubule affinity-regulating kinase 4
Type:PROTEIN
Mol. Mass.:82561.08
Organism:Homo sapiens (Human)
Description:ChEMBL_774620
Residue:752
BDBM4814
NameBDBM4814
Synonyms:CHEMBL535 N-[2-(diethylamino)ethyl]-5-{[(3Z)-5-fluoro-2-oxo-2,3-dihydro-1H-indol-3-ylidene]methyl}-2,4-dimethyl-1H-pyrrole-3-carboxamide SUNITINIB US10464902, Sunitinib US9914707, SU11248
TypeSmall organic molecule
Emp. Form.C22H27FN4O2
Mol. Mass.398.4738
SMILESCCN(CC)CCNC(=O)c1c(C)[nH]c(\C=C2/C(=O)Nc3ccc(F)cc23)c1C