Reaction Details
TargetSerine protease 1
LigandBDBM50326055
Substrate/Competitorn/a
Meas. Tech.ChEMBL_656024 (CHEMBL1245068)
IC50>10000±n/a nM
Citation Liverton, NJCarroll, SSDimuzio, JFandozzi, CGraham, DJHazuda, DHolloway, MKLudmerer, SWMcCauley, JAMcIntyre, CJOlsen, DBRudd, MTStahlhut, MVacca, JP MK-7009, a potent and selective inhibitor of hepatitis C virus NS3/4A protease. Antimicrob Agents Chemother54:305-11 (2009) 
 
Serine protease 1
Name:Serine protease 1
Type:Enzyme
Mol. Mass.:26557.80
Organism:Homo sapiens (Human)
Description:P07477
Residue:247
BDBM50326055
NameBDBM50326055
Synonyms:(1R,21S,24S)-21-tert-Butyl-N-((1R,2R)-1-{[(cyclopropylsulfonyl)amino]carbonyl}-2-ethylcyclopropyl)-16,16-dimethyl-3,19,22-trioxo-2,18-dioxa-4,20,23-triazatetracyclo[21.2.1.14,7.06,11]-heptacosa-6,8,10-triene-24-carboxamide CHEMBL599872 | MK-7009
TypeSmall organic molecule
Emp. Form.C38H53N5O9S
Mol. Mass.755.921
SMILESCC(C)(C)[C@@H]1NC(=O)OCC(C)(C)CCCCc2cccc3CN(Cc23)C(=O)O[C@@H]2C[C@H](N(C2)C1=O)C(=O)N[C@@]1(C[C@H]1C=C)C(=O)NS(=O)(=O)C1CC1