Reaction Details
TargetEnvelope glycoprotein gp160
LigandBDBM50326057
Substrate/Competitorn/a
Meas. Tech.ChEMBL_656701 (CHEMBL1245745)
IC50 1.71±n/a nM
Citation Jenkinson, SThomson, MMcCoy, DEdelstein, MDanehower, SLawrence, WWheelan, PSpaltenstein, AGudmundsson, K Blockade of X4-tropic HIV-1 cellular entry by GSK812397, a potent noncompetitive CXCR4 receptor antagonist. Antimicrob Agents Chemother54:817-24 (2010) 
 
Envelope glycoprotein gp160
Name:Envelope glycoprotein gp160
Type:n/a
Mol. Mass.:97241.93
Organism:Human immunodeficiency virus type 1 group M subtype B (isolate HXB2)
Description:n/a
Residue:856
BDBM50326057
NameBDBM50326057
Synonyms:([5-(4-Methyl-1-piperazinyl)-2-({methyl[(8S)-5,6,7,8-tetrahydro-8-quinolinyl]amino}methyl)imidazo[1,2-a]pyridin-3-yl]methanol) | CHEMBL1242210
TypeSmall organic molecule
Emp. Form.C24H32N6O
Mol. Mass.420.5505
SMILESCN(Cc1nc2cccc(N3CCN(C)CC3)n2c1CO)[C@H]1CCCc2cccnc12