Reaction Details
TargetBreakpoint cluster region protein/Tyrosine-protein kinase ABL1
LigandBDBM50326061
Substrate/Competitorn/a
Meas. Tech.ChEMBL_659667 (CHEMBL1246089)
IC50 500±n/a nM
Citation Reddy, MVPallela, VRCosenza, SCMallireddigari, MRPatti, RBonagura, MTruongcao, MAkula, BJatiani, SSReddy, EP Design, synthesis and evaluation of (E)-alpha-benzylthio chalcones as novel inhibitors of BCR-ABL kinase. Bioorg Med Chem18:2317-26 (2010) 
 
Breakpoint cluster region protein/Tyrosine-protein kinase ABL1
Name:Breakpoint cluster region protein/Tyrosine-protein kinase ABL1
Type:Enzyme
Mol. Mass.:n/a
Description:n/a
Components:This complex has 2 components.
Component 1
Name:Tyrosine-protein kinase ABL1
Synonyms:ABL ABL1_HUMAN JTK7 Proto-oncogene tyrosine-protein kinase ABL1 Tyrosine-protein kinase ABL V-abl Abelson murine leukemia viral oncogene homolog 1 p150 | tyrosine-protein kinase ABL1 isoform a
Type:Enzyme
Mol. Mass.:122897.30
Organism:Homo sapiens (Human)
Description:P00519
Residue:1130
Component 2
Name:Breakpoint cluster region protein
Synonyms:BCR BCR_HUMAN Breakpoint cluster region protein | D22S11
Type:PROTEIN
Mol. Mass.:142824.75
Organism:Homo sapiens (Human)
Description:ChEMBL_305348
Residue:1271
BDBM50326061
NameBDBM50326061
Synonyms:(E)-4-(2-(4-Bromobenzylthio)-3-(4-fluoro-3-nitrophenyl)acryloyl)benzoic acid | CHEMBL1242482
TypeSmall organic molecule
Emp. Form.C23H15BrFNO5S
Mol. Mass.516.336
SMILESOC(=O)c1ccc(cc1)C(=O)C(\SCc1ccc(Br)cc1)=C/c1ccc(F)c(c1)[N+]([O-])=O