Reaction Details
TargetCaspase-3
LigandBDBM10246
Substrate/Competitorn/a
Meas. Tech.ChEMBL_659717 (CHEMBL1246139)
IC50 1.6±n/a nM
Citation Newton, ASGlória, PMGonçalves, LMdos Santos, DJMoreira, RGuedes, RCSantos, MM Synthesis and evaluation of vinyl sulfones as caspase-3 inhibitors. A structure-activity study. Eur J Med Chem45:3858-63 (2010) 
 
Caspase-3
Name:Caspase-3
Type:Hydrolase; heterotetramer of two heterodimers
Mol. Mass.:31607.55
Organism:Homo sapiens (Human)
Description:n/a
Residue:277
BDBM10246
NameBDBM10246
Synonyms:(4S)-4-{[(1S)-1-{[(2S)-1-carboxy-3-oxopropan-2-yl]carbamoyl}-2-methylpropyl]carbamoyl}-4-[(3S)-3-acetamido-3-formamidopropanoic acid]butanoic acid CHEMBL417149
TypeSmall organic molecule
Emp. Form.C20H30N4O11
Mol. Mass.502.4724
SMILESCC(C)[C@H](NC(=O)[C@H](CCC(O)=O)NC(=O)[C@H](CC(O)=O)NC(C)=O)C(=O)N[C@@H](CC(O)=O)C=O