Reaction Details
TargetCarbonic anhydrase 12
LigandBDBM50326108
Substrate/Competitorn/a
Meas. Tech.ChEMBL_659853 (CHEMBL1246743)
Ki 34.6±n/a nM
Citation Brzozowski, ZSlawinski, JInnocenti, ASupuran, CT Carbonic anhydrase inhibitors. Regioselective synthesis of novel 1-substituted 1,4-dihydro-4-oxo-3-pyridinesulfonamides and their inhibition of the human cytosolic isozymes I and II and transmembrane cancer-associated isozymes IX and XII. Eur J Med Chem45:3656-61 (2010) 
 
Carbonic anhydrase 12
Name:Carbonic anhydrase 12
Type:Enzyme
Mol. Mass.:39456.00
Organism:Homo sapiens (Human)
Description:Catalytic domain of human cloned isozyme was used in the assay
Residue:354
BDBM50326108
NameBDBM50326108
Synonyms:1,4-Dihydro-1-(2,4-dinitrophenyl)-4-oxo-3-pyridinesulfonamide | CHEMBL1242889
TypeSmall organic molecule
Emp. Form.C11H8N4O7S
Mol. Mass.340.269
SMILESNS(=O)(=O)c1cn(ccc1=O)-c1ccc(cc1[N+]([O-])=O)[N+]([O-])=O