Reaction Details
TargetCarbonic anhydrase 12
LigandBDBM50326111
Substrate/Competitorn/a
Meas. Tech.ChEMBL_659853 (CHEMBL1246743)
Ki 113±n/a nM
Citation Brzozowski, ZSlawinski, JInnocenti, ASupuran, CT Carbonic anhydrase inhibitors. Regioselective synthesis of novel 1-substituted 1,4-dihydro-4-oxo-3-pyridinesulfonamides and their inhibition of the human cytosolic isozymes I and II and transmembrane cancer-associated isozymes IX and XII. Eur J Med Chem45:3656-61 (2010) 
 
Carbonic anhydrase 12
Name:Carbonic anhydrase 12
Type:Enzyme
Mol. Mass.:39456.00
Organism:Homo sapiens (Human)
Description:Catalytic domain of human cloned isozyme was used in the assay
Residue:354
BDBM50326111
NameBDBM50326111
Synonyms:1,4-Dihydro-4-oxo-1-(6-purinyl)-3-pyridinesulfonamide | CHEMBL1240620
TypeSmall organic molecule
Emp. Form.C10H8N6O3S
Mol. Mass.292.274
SMILESNS(=O)(=O)c1cn(ccc1=O)-c1ncnc2nc[nH]c12