Reaction Details
TargetCarbonic anhydrase 9
LigandBDBM50326105
Substrate/Competitorn/a
Meas. Tech.ChEMBL_659852 (CHEMBL1246742)
Ki 10.1±n/a nM
Citation Brzozowski, ZSlawinski, JInnocenti, ASupuran, CT Carbonic anhydrase inhibitors. Regioselective synthesis of novel 1-substituted 1,4-dihydro-4-oxo-3-pyridinesulfonamides and their inhibition of the human cytosolic isozymes I and II and transmembrane cancer-associated isozymes IX and XII. Eur J Med Chem45:3656-61 (2010) 
 
Carbonic anhydrase 9
Name:Carbonic anhydrase 9
Type:Enzyme
Mol. Mass.:49669.03
Organism:Homo sapiens (Human)
Description:Catalytic domain of human cloned isozyme was used in the assay
Residue:459
BDBM50326105
NameBDBM50326105
Synonyms:1,4-Dihydro-1-(4-nitrophenacyl)-4-oxo-3-pyridinesulfonamide | CHEMBL1242792
TypeSmall organic molecule
Emp. Form.C13H11N3O6S
Mol. Mass.337.308
SMILESNS(=O)(=O)c1cn(CC(=O)c2ccc(cc2)[N+]([O-])=O)ccc1=O