Reaction Details
TargetCarbonic anhydrase 9
LigandBDBM50326117
Substrate/Competitorn/a
Meas. Tech.ChEMBL_659852 (CHEMBL1246742)
Ki 7.8±n/a nM
Citation Brzozowski, ZSlawinski, JInnocenti, ASupuran, CT Carbonic anhydrase inhibitors. Regioselective synthesis of novel 1-substituted 1,4-dihydro-4-oxo-3-pyridinesulfonamides and their inhibition of the human cytosolic isozymes I and II and transmembrane cancer-associated isozymes IX and XII. Eur J Med Chem45:3656-61 (2010) 
 
Carbonic anhydrase 9
Name:Carbonic anhydrase 9
Type:Enzyme
Mol. Mass.:49669.03
Organism:Homo sapiens (Human)
Description:Catalytic domain of human cloned isozyme was used in the assay
Residue:459
BDBM50326117
NameBDBM50326117
Synonyms:1-Benzyl-1,4-dihydro-4-oxo-3-pyridinesulfonamide | CHEMBL1240573
TypeSmall organic molecule
Emp. Form.C12H12N2O3S
Mol. Mass.264.3
SMILESNS(=O)(=O)c1cn(Cc2ccccc2)ccc1=O