Reaction Details
TargetCarbonic anhydrase 2
LigandBDBM50326112
Substrate/Competitorn/a
Meas. Tech.ChEMBL_659851 (CHEMBL1246741)
Ki 102±n/a nM
Citation Brzozowski, ZSlawinski, JInnocenti, ASupuran, CT Carbonic anhydrase inhibitors. Regioselective synthesis of novel 1-substituted 1,4-dihydro-4-oxo-3-pyridinesulfonamides and their inhibition of the human cytosolic isozymes I and II and transmembrane cancer-associated isozymes IX and XII. Eur J Med Chem45:3656-61 (2010) 
 
Carbonic anhydrase 2
Name:Carbonic anhydrase 2
Type:Enzyme
Mol. Mass.:29250.71
Organism:Homo sapiens (Human)
Description:P00918
Residue:260
BDBM50326112
NameBDBM50326112
Synonyms:1,4-Dihydro-1-(2-methoxycarbonylaminobenzoyl)-4-oxo-3-pyridinesulfonamide | CHEMBL1241532
TypeSmall organic molecule
Emp. Form.C14H13N3O6S
Mol. Mass.351.335
SMILESCOC(=O)Nc1ccccc1C(=O)n1ccc(=O)c(c1)S(N)(=O)=O