Reaction Details
TargetCarbonic anhydrase 2
LigandBDBM50326109
Substrate/Competitorn/a
Meas. Tech.ChEMBL_659851 (CHEMBL1246741)
Ki 50.5±n/a nM
Citation Brzozowski, ZSlawinski, JInnocenti, ASupuran, CT Carbonic anhydrase inhibitors. Regioselective synthesis of novel 1-substituted 1,4-dihydro-4-oxo-3-pyridinesulfonamides and their inhibition of the human cytosolic isozymes I and II and transmembrane cancer-associated isozymes IX and XII. Eur J Med Chem45:3656-61 (2010) 
 
Carbonic anhydrase 2
Name:Carbonic anhydrase 2
Type:Enzyme
Mol. Mass.:29250.71
Organism:Homo sapiens (Human)
Description:P00918
Residue:260
BDBM50326109
NameBDBM50326109
Synonyms:1,4-Dihydro-4-oxo-1-(3-sulfamoylpyrid-4-yl)-3-pyridiensulfonamide | CHEMBL1242890
TypeSmall organic molecule
Emp. Form.C10H10N4O5S2
Mol. Mass.330.34
SMILESNS(=O)(=O)c1cnccc1-n1ccc(=O)c(c1)S(N)(=O)=O