Reaction Details
TargetCarbonic anhydrase 2
LigandBDBM50326106
Substrate/Competitorn/a
Meas. Tech.ChEMBL_659851 (CHEMBL1246741)
Ki 105±n/a nM
Citation Brzozowski, ZSlawinski, JInnocenti, ASupuran, CT Carbonic anhydrase inhibitors. Regioselective synthesis of novel 1-substituted 1,4-dihydro-4-oxo-3-pyridinesulfonamides and their inhibition of the human cytosolic isozymes I and II and transmembrane cancer-associated isozymes IX and XII. Eur J Med Chem45:3656-61 (2010) 
 
Carbonic anhydrase 2
Name:Carbonic anhydrase 2
Type:Enzyme
Mol. Mass.:29250.71
Organism:Homo sapiens (Human)
Description:P00918
Residue:260
BDBM50326106
NameBDBM50326106
Synonyms:1,4-Dihydro-1-(3-nitrophenacyl)-4-oxo-3-pyridinesulfonamide | CHEMBL1242793
TypeSmall organic molecule
Emp. Form.C13H11N3O6S
Mol. Mass.337.308
SMILESNS(=O)(=O)c1cn(CC(=O)c2cccc(c2)[N+]([O-])=O)ccc1=O