Reaction Details
TargetCarbonic anhydrase 2
LigandBDBM50326117
Substrate/Competitorn/a
Meas. Tech.ChEMBL_659851 (CHEMBL1246741)
Ki 80±n/a nM
Citation Brzozowski, ZSlawinski, JInnocenti, ASupuran, CT Carbonic anhydrase inhibitors. Regioselective synthesis of novel 1-substituted 1,4-dihydro-4-oxo-3-pyridinesulfonamides and their inhibition of the human cytosolic isozymes I and II and transmembrane cancer-associated isozymes IX and XII. Eur J Med Chem45:3656-61 (2010) 
 
Carbonic anhydrase 2
Name:Carbonic anhydrase 2
Type:Enzyme
Mol. Mass.:29250.71
Organism:Homo sapiens (Human)
Description:P00918
Residue:260
BDBM50326117
NameBDBM50326117
Synonyms:1-Benzyl-1,4-dihydro-4-oxo-3-pyridinesulfonamide | CHEMBL1240573
TypeSmall organic molecule
Emp. Form.C12H12N2O3S
Mol. Mass.264.3
SMILESNS(=O)(=O)c1cn(Cc2ccccc2)ccc1=O