Reaction Details
TargetCarbonic anhydrase 1
LigandBDBM50326118
Substrate/Competitorn/a
Meas. Tech.ChEMBL_659850 (CHEMBL1246740)
Ki 3440±n/a nM
Citation Brzozowski, ZSlawinski, JInnocenti, ASupuran, CT Carbonic anhydrase inhibitors. Regioselective synthesis of novel 1-substituted 1,4-dihydro-4-oxo-3-pyridinesulfonamides and their inhibition of the human cytosolic isozymes I and II and transmembrane cancer-associated isozymes IX and XII. Eur J Med Chem45:3656-61 (2010) 
 
Carbonic anhydrase 1
Name:Carbonic anhydrase 1
Type:Enzyme
Mol. Mass.:28873.37
Organism:Homo sapiens (Human)
Description:P00915
Residue:261
BDBM50326118
NameBDBM50326118
Synonyms:1,4-Dihydro-1-methyl-4-oxo-3-pyridinesulfonamide | CHEMBL1240572
TypeSmall organic molecule
Emp. Form.C6H8N2O3S
Mol. Mass.188.204
SMILESCn1ccc(=O)c(c1)S(N)(=O)=O