Reaction Details
TargetReceptor-type tyrosine-protein phosphatase F
LigandBDBM50326152
Substrate/Competitorn/a
Meas. Tech.ChEMBL_658719 (CHEMBL1248460)
IC50 2872±n/a nM
Citation Lakshminarayana, NPrasad, YRGharat, LThomas, ANarayanan, SRaghuram, ASrinivasan, CVGopalan, B Synthesis and evaluation of some novel dibenzo[b,d]furan carboxylic acids as potential anti-diabetic agents. Eur J Med Chem45:3709-18 (2010) 
 
Receptor-type tyrosine-protein phosphatase F
Name:Receptor-type tyrosine-protein phosphatase F
Type:Protein
Mol. Mass.:212869.85
Organism:Homo sapiens (Human)
Description:P10586
Residue:1907
BDBM50326152
NameBDBM50326152
Synonyms:8-[2-(4-Nitrophenyl)thiazol-4-yl]dibenzo[b,d]furan-4-carboxylic acid | CHEMBL1242552
TypeSmall organic molecule
Emp. Form.C22H12N2O5S
Mol. Mass.416.406
SMILESOC(=O)c1cccc2c3cc(ccc3oc12)-c1csc(n1)-c1ccc(cc1)[N+]([O-])=O