Reaction Details
TargetReceptor-type tyrosine-protein phosphatase F
LigandBDBM50326158
Substrate/Competitorn/a
Meas. Tech.ChEMBL_658719 (CHEMBL1248460)
IC50 2144±n/a nM
Citation Lakshminarayana, NPrasad, YRGharat, LThomas, ANarayanan, SRaghuram, ASrinivasan, CVGopalan, B Synthesis and evaluation of some novel dibenzo[b,d]furan carboxylic acids as potential anti-diabetic agents. Eur J Med Chem45:3709-18 (2010) 
 
Receptor-type tyrosine-protein phosphatase F
Name:Receptor-type tyrosine-protein phosphatase F
Type:Protein
Mol. Mass.:212869.85
Organism:Homo sapiens (Human)
Description:P10586
Residue:1907
BDBM50326158
NameBDBM50326158
Synonyms:8-{2-[4-(2,6-Dimethylmorpholino)phenyl]thiazol-4-yl}dibenzo[b,d]furan-4-carboxylic acid | CHEMBL1242643
TypeSmall organic molecule
Emp. Form.C28H24N2O4S
Mol. Mass.484.566
SMILESCC1CN(CC(C)O1)c1ccc(cc1)-c1nc(cs1)-c1ccc2oc3c(cccc3c2c1)C(O)=O