Reaction Details
TargetTyrosine-protein phosphatase non-receptor type 1
LigandBDBM50326165
Substrate/Competitorn/a
Meas. Tech.ChEMBL_658721 (CHEMBL1248462)
Ki 18±n/a nM
Citation Lakshminarayana, NPrasad, YRGharat, LThomas, ANarayanan, SRaghuram, ASrinivasan, CVGopalan, B Synthesis and evaluation of some novel dibenzo[b,d]furan carboxylic acids as potential anti-diabetic agents. Eur J Med Chem45:3709-18 (2010) 
 
Tyrosine-protein phosphatase non-receptor type 1
Name:Tyrosine-protein phosphatase non-receptor type 1
Type:Protein phosphatase
Mol. Mass.:49963.76
Organism:Homo sapiens (Human)
Description:Human recombinant GST-fusion PTP1B (1-435).
Residue:435
BDBM50326165
NameBDBM50326165
Synonyms:CHEMBL1241315 | oxalylaminobenzoic acid
TypeSmall organic molecule
Emp. Form.C34H35N3O11
Mol. Mass.661.6552
SMILESCCc1cc(C[C@H]2NC(=O)CN(CCCCOc3cccc(O)c3C(=O)OC)C2=O)ccc1N(C(=O)C(O)=O)c1ccccc1C(O)=O