Reaction Details
TargetAlpha-1B adrenergic receptor
LigandBDBM50326197
Substrate/Competitorn/a
Meas. Tech.ChEMBL_659314 (CHEMBL1247778)
Ki 758±n/a nM
Citation Sakurada, TGill, MBFrausto, SCopits, BNoguchi, KShimamoto, KSwanson, GTSakai, R Novel N-methylated 8-oxoisoguanines from Pacific sponges with diverse neuroactivities. J Med Chem53:6089-99 (2010) 
 
Alpha-1B adrenergic receptor
Name:Alpha-1B adrenergic receptor
Type:Enzyme
Mol. Mass.:56862.13
Organism:Homo sapiens (Human)
Description:P35368
Residue:520
BDBM50326197
NameBDBM50326197
Synonyms:1,9-dimethyl-2,8-dioxo-2,3,8,9-tetrahydro-1H-purin-6(7H)-iminium chloride | CHEMBL1241328
TypeSmall organic molecule
Emp. Form.C7H9N5O2
Mol. Mass.195.1787
SMILESCn1c2nc(=O)n(C)c(N)c2[nH]c1=O