Reaction Details
Target5-hydroxytryptamine receptor 1E
LigandBDBM50326197
Substrate/Competitorn/a
Meas. Tech.ChEMBL_659316 (CHEMBL1247780)
Ki 2900±n/a nM
Citation Sakurada, TGill, MBFrausto, SCopits, BNoguchi, KShimamoto, KSwanson, GTSakai, R Novel N-methylated 8-oxoisoguanines from Pacific sponges with diverse neuroactivities. J Med Chem53:6089-99 (2010) 
 
5-hydroxytryptamine receptor 1E
Name:5-hydroxytryptamine receptor 1E
Type:G Protein-Coupled Receptor (GPCR)
Mol. Mass.:41697.80
Organism:Homo sapiens (Human)
Description:gi_112822
Residue:365
BDBM50326197
NameBDBM50326197
Synonyms:1,9-dimethyl-2,8-dioxo-2,3,8,9-tetrahydro-1H-purin-6(7H)-iminium chloride | CHEMBL1241328
TypeSmall organic molecule
Emp. Form.C7H9N5O2
Mol. Mass.195.1787
SMILESCn1c2nc(=O)n(C)c(N)c2[nH]c1=O