Reaction Details
TargetBaculoviral IAP repeat-containing protein 3
LigandBDBM50326213
Substrate/Competitorn/a
Meas. Tech.ChEMBL_659436 (CHEMBL1248346)
IC50 99.6±n/a nM
Citation Sun, HLu, JLiu, LYi, HQiu, SYang, CYDeschamps, JRWang, S Nonpeptidic and potent small-molecule inhibitors of cIAP-1/2 and XIAP proteins. J Med Chem53:6361-7 (2010) 
 
Baculoviral IAP repeat-containing protein 3
Name:Baculoviral IAP repeat-containing protein 3
Type:Protein
Mol. Mass.:68365.75
Organism:Homo sapiens (Human)
Description:Q13489
Residue:604
BDBM50326213
NameBDBM50326213
Synonyms:(3S,6S,9S,10aR)-N-Benzhydryl-9-hydroxy-6-((S)-2-(methylamino)propanamido)-5-oxodecahydropyrrolo[1,2-a]azocine-3-carboxamide | CHEMBL1242922
TypeSmall organic molecule
Emp. Form.C28H36N4O4
Mol. Mass.492.6098
SMILESCN[C@@H](C)C(=O)N[C@H]1CC[C@H](O)C[C@H]2CC[C@H](N2C1=O)C(=O)NC(c1ccccc1)c1ccccc1