Reaction Details
TargetBaculoviral IAP repeat-containing protein 2
LigandBDBM50273699
Substrate/Competitorn/a
Meas. Tech.ChEMBL_659380 (CHEMBL1248007)
Ki 1.3±n/a nM
Citation Sun, HLu, JLiu, LYi, HQiu, SYang, CYDeschamps, JRWang, S Nonpeptidic and potent small-molecule inhibitors of cIAP-1/2 and XIAP proteins. J Med Chem53:6361-7 (2010) 
 
Baculoviral IAP repeat-containing protein 2
Name:Baculoviral IAP repeat-containing protein 2
Type:Protein
Mol. Mass.:69900.47
Organism:Homo sapiens (Human)
Description:Q13490
Residue:618
BDBM50273699
NameBDBM50273699
Synonyms:(5S,8S,10aR)-N-Benzhydryl-5-((S)-2-(methyl-amino)propanamido)-6-oxo-3-(2-phenyl-acetyl)decahydropyrrolo[1,2-a][1,5]diazocine-8-carboxamide SM-337
TypeSmall organic molecule
Emp. Form.C35H41N5O4
Mol. Mass.595.7311
SMILESCN[C@@H](C)C(=O)N[C@H]1CN(CC[C@H]2CC[C@H](N2C1=O)C(=O)NC(c1ccccc1)c1ccccc1)C(=O)Cc1ccccc1