Reaction Details
TargetBaculoviral IAP repeat-containing protein 2
LigandBDBM50326215
Substrate/Competitorn/a
Meas. Tech.ChEMBL_659380 (CHEMBL1248007)
IC50 54.5±n/a nM
Citation Sun, HLu, JLiu, LYi, HQiu, SYang, CYDeschamps, JRWang, S Nonpeptidic and potent small-molecule inhibitors of cIAP-1/2 and XIAP proteins. J Med Chem53:6361-7 (2010) 
 
Baculoviral IAP repeat-containing protein 2
Name:Baculoviral IAP repeat-containing protein 2
Type:Protein
Mol. Mass.:69900.47
Organism:Homo sapiens (Human)
Description:Q13490
Residue:618
BDBM50326215
NameBDBM50326215
Synonyms:(3S,6S,9R,10aR)-N-benzhydryl-9-hydroxy-6-((S)-2-(methylamino)propanamido)-5-oxodecahydropyrrolo[1,2-a]azocine-3-carboxamide | CHEMBL1243385
TypeSmall organic molecule
Emp. Form.C28H36N4O4
Mol. Mass.492.6098
SMILESCN[C@@H](C)C(=O)N[C@H]1CC[C@@H](O)C[C@H]2CC[C@H](N2C1=O)C(=O)NC(c1ccccc1)c1ccccc1