Reaction Details
TargetE3 ubiquitin-protein ligase XIAP
LigandBDBM50326212
Substrate/Competitorn/a
Meas. Tech.ChEMBL_659379 (CHEMBL1248006)
IC50 1017±n/a nM
Citation Sun, HLu, JLiu, LYi, HQiu, SYang, CYDeschamps, JRWang, S Nonpeptidic and potent small-molecule inhibitors of cIAP-1/2 and XIAP proteins. J Med Chem53:6361-7 (2010) 
 
E3 ubiquitin-protein ligase XIAP
Name:E3 ubiquitin-protein ligase XIAP
Type:Protein
Mol. Mass.:56685.27
Organism:Homo sapiens (Human)
Description:P98170
Residue:497
BDBM50326212
NameBDBM50326212
Synonyms:(3S,6S,9S,10aR)-N-Benzhydryl-6-((S)-2-(methylamino)-propanamido)-5-oxo-9-(2-phenylacetamido)decahydropyrrolo-[1,2-a]azocine-3-carboxamide | CHEMBL1241425
TypeSmall organic molecule
Emp. Form.C36H43N5O4
Mol. Mass.609.7577
SMILESCN[C@@H](C)C(=O)N[C@H]1CC[C@@H](C[C@H]2CC[C@H](N2C1=O)C(=O)NC(c1ccccc1)c1ccccc1)NC(=O)Cc1ccccc1