Reaction Details
TargetHistamine H4 receptor
LigandBDBM50326285
Substrate/Competitorn/a
Meas. Tech.ChEMBL_659951 (CHEMBL1247352)
Ki 1300±n/a nM
Citation Ishikawa, MWatanabe, TKudo, TYokoyama, FYamauchi, MKato, KKakui, NSato, Y Investigation of the histamine H3 receptor binding site. Design and synthesis of hybrid agonists with a lipophilic side chain. J Med Chem53:6445-56 (2010) 
 
Histamine H4 receptor
Name:Histamine H4 receptor
Type:G Protein-Coupled Receptor (GPCR)
Mol. Mass.:44517.02
Organism:Homo sapiens (Human)
Description:Binding assays were using CHO cells stably expressing hH4R receptors.
Residue:390
BDBM50326285
NameBDBM50326285
Synonyms:(S)-4-(1-(1H-Imidazol-4-yl)-2-(4-(trifluoromethyl)phenylthio)-ethyl)piperidine | CHEMBL1243394
TypeSmall organic molecule
Emp. Form.C17H20F3N3S
Mol. Mass.355.421
SMILESFC(F)(F)c1ccc(SC[C@@H](C2CCNCC2)c2cnc[nH]2)cc1