Reaction Details
TargetCytochrome P450 2D6
LigandBDBM50326287
Substrate/Competitorn/a
Meas. Tech.ChEMBL_659956 (CHEMBL1247357)
IC50 820±n/a nM
Citation Ishikawa, MWatanabe, TKudo, TYokoyama, FYamauchi, MKato, KKakui, NSato, Y Investigation of the histamine H3 receptor binding site. Design and synthesis of hybrid agonists with a lipophilic side chain. J Med Chem53:6445-56 (2010) 
 
Cytochrome P450 2D6
Name:Cytochrome P450 2D6
Type:Protein
Mol. Mass.:55774.82
Organism:Homo sapiens (Human)
Description:P10635
Residue:497
BDBM50326287
NameBDBM50326287
Synonyms:2-(2-(4-tert-Butylphenylthio)-1-(1H-imidazol-4-yl)ethyl)pyridine | CHEMBL1243335
TypeSmall organic molecule
Emp. Form.C20H23N3S
Mol. Mass.337.482
SMILESCC(C)(C)c1ccc(SCC(c2cnc[nH]2)c2ccccn2)cc1