Reaction Details
TargetCytochrome P450 3A4
LigandBDBM50326286
Substrate/Competitorn/a
Meas. Tech.ChEMBL_659957 (CHEMBL1247358)
IC50 17000±n/a nM
Citation Ishikawa, MWatanabe, TKudo, TYokoyama, FYamauchi, MKato, KKakui, NSato, Y Investigation of the histamine H3 receptor binding site. Design and synthesis of hybrid agonists with a lipophilic side chain. J Med Chem53:6445-56 (2010) 
 
Cytochrome P450 3A4
Name:Cytochrome P450 3A4
Type:Enzyme
Mol. Mass.:57349.57
Organism:Homo sapiens (Human)
Description:n/a
Residue:503
BDBM50326286
NameBDBM50326286
Synonyms:(R)-4-(1-(1H-Imidazol-4-yl)-2-(4-(trifluoromethyl)phenylthio)ethyl)piperidine | CHEMBL1243395
TypeSmall organic molecule
Emp. Form.C17H20F3N3S
Mol. Mass.355.421
SMILESFC(F)(F)c1ccc(SC[C@H](C2CCNCC2)c2cnc[nH]2)cc1