Reaction Details
TargetCytochrome P450 3A4
LigandBDBM50326292
Substrate/Competitorn/a
Meas. Tech.ChEMBL_659957 (CHEMBL1247358)
IC50 6500±n/a nM
Citation Ishikawa, MWatanabe, TKudo, TYokoyama, FYamauchi, MKato, KKakui, NSato, Y Investigation of the histamine H3 receptor binding site. Design and synthesis of hybrid agonists with a lipophilic side chain. J Med Chem53:6445-56 (2010) 
 
Cytochrome P450 3A4
Name:Cytochrome P450 3A4
Type:Enzyme
Mol. Mass.:57349.57
Organism:Homo sapiens (Human)
Description:n/a
Residue:503
BDBM50326292
NameBDBM50326292
Synonyms:4-(2-(4-tert-Butylphenylthio)-1-(1H-imidazol-4-yl)ethyl)piperidine | CHEMBL1243333
TypeSmall organic molecule
Emp. Form.C20H29N3S
Mol. Mass.343.529
SMILESCC(C)(C)c1ccc(SCC(C2CCNCC2)c2cnc[nH]2)cc1