Reaction Details
TargetCytochrome P450 3A4
LigandBDBM50317865
Substrate/Competitorn/a
Meas. Tech.ChEMBL_659957 (CHEMBL1247358)
IC50 470±n/a nM
Citation Ishikawa, MWatanabe, TKudo, TYokoyama, FYamauchi, MKato, KKakui, NSato, Y Investigation of the histamine H3 receptor binding site. Design and synthesis of hybrid agonists with a lipophilic side chain. J Med Chem53:6445-56 (2010) 
 
Cytochrome P450 3A4
Name:Cytochrome P450 3A4
Type:Enzyme
Mol. Mass.:57349.57
Organism:Homo sapiens (Human)
Description:n/a
Residue:503
BDBM50317865
NameBDBM50317865
Synonyms:2-(2-(4-tert-Butylphenylthio)ethyl)-1H-imidazole CHEMBL1098230
TypeSmall organic molecule
Emp. Form.C15H20N2S
Mol. Mass.260.398
SMILESCC(C)(C)c1ccc(SCCc2cnc[nH]2)cc1