Reaction Details
TargetCalpain-1 catalytic subunit
LigandBDBM50326298
Substrate/Competitorn/a
Meas. Tech.ChEMBL_659958 (CHEMBL1247359)
Ki 41±n/a nM
Citation Ovat, ALi, ZZHampton, CYAsress, SAFernández, FMGlass, JDPowers, JC Peptidyl alpha-ketoamides with nucleobases, methylpiperazine, and dimethylaminoalkyl substituents as calpain inhibitors. J Med Chem53:6326-36 (2010) 
 
Calpain-1 catalytic subunit
Name:Calpain-1 catalytic subunit
Type:Catalytic subunit; forms a heterodimer with a small (regulatory) subunit (CAPNS1)
Mol. Mass.:81729.82
Organism:Sus scrofa (pig)
Description:Native calpain-1 from porcine erythrocytes, purchased from Calbiochem, was used in assay.
Residue:714
BDBM50326298
NameBDBM50326298
Synonyms:3-(Benzyloxycarbonyl-L-leucylamino)-N-(3-(6-amino-2-methoxy-9H-purin-9-yl)propyl)-2-oxophenylbutanamide | CHEMBL1240874
TypeSmall organic molecule
Emp. Form.C33H40N8O6
Mol. Mass.644.7207
SMILESCOc1nc(N)c2ncn(CCCNC(=O)C(=O)C(Cc3ccccc3)NC(=O)[C@H](CC(C)C)NC(=O)OCc3ccccc3)c2n1