Reaction Details
TargetCathepsin B
LigandBDBM50326302
Substrate/Competitorn/a
Meas. Tech.ChEMBL_659960 (CHEMBL1247361)
Ki 1420±n/a nM
Citation Ovat, ALi, ZZHampton, CYAsress, SAFernández, FMGlass, JDPowers, JC Peptidyl alpha-ketoamides with nucleobases, methylpiperazine, and dimethylaminoalkyl substituents as calpain inhibitors. J Med Chem53:6326-36 (2010) 
 
Cathepsin B
Name:Cathepsin B
Type:Enzyme
Mol. Mass.:37819.69
Organism:Homo sapiens (Human)
Description:gi_63102437
Residue:339
BDBM50326302
NameBDBM50326302
Synonyms:3-(Benzyloxycarbonyl-L-leucylamino)-N-(3-(4-methylpiperazin-1-yl)propyl)-2-oxopentanamide | CHEMBL1242987
TypeSmall organic molecule
Emp. Form.C27H43N5O5
Mol. Mass.517.6608
SMILESCCC(NC(=O)[C@H](CC(C)C)NC(=O)OCc1ccccc1)C(=O)C(=O)NCCCN1CCN(C)CC1