Reaction Details
TargetCalpain-2 catalytic subunit
LigandBDBM50326303
Substrate/Competitorn/a
Meas. Tech.ChEMBL_659959 (CHEMBL1247360)
Ki 70±n/a nM
Citation Ovat, ALi, ZZHampton, CYAsress, SAFernández, FMGlass, JDPowers, JC Peptidyl alpha-ketoamides with nucleobases, methylpiperazine, and dimethylaminoalkyl substituents as calpain inhibitors. J Med Chem53:6326-36 (2010) 
 
Calpain-2 catalytic subunit
Name:Calpain-2 catalytic subunit
Type:n/a
Mol. Mass.:37789.71
Organism:Sus scrofa
Description:n/a
Residue:324
BDBM50326303
NameBDBM50326303
Synonyms:3-(Benzyloxycarbonyl-L-leucylamino)-N-(3-(6-amino-9H-purin-9-yl)propyl)-2-oxopentanamide | CHEMBL1242960
TypeSmall organic molecule
Emp. Form.C27H36N8O5
Mol. Mass.552.6253
SMILESCCC(NC(=O)[C@H](CC(C)C)NC(=O)OCc1ccccc1)C(=O)C(=O)NCCCn1cnc2c(N)ncnc12