Reaction Details
TargetCalpain-1 catalytic subunit
LigandBDBM50326307
Substrate/Competitorn/a
Meas. Tech.ChEMBL_659958 (CHEMBL1247359)
Ki 1370±n/a nM
Citation Ovat, ALi, ZZHampton, CYAsress, SAFernández, FMGlass, JDPowers, JC Peptidyl alpha-ketoamides with nucleobases, methylpiperazine, and dimethylaminoalkyl substituents as calpain inhibitors. J Med Chem53:6326-36 (2010) 
 
Calpain-1 catalytic subunit
Name:Calpain-1 catalytic subunit
Type:Catalytic subunit; forms a heterodimer with a small (regulatory) subunit (CAPNS1)
Mol. Mass.:81729.82
Organism:Sus scrofa (pig)
Description:Native calpain-1 from porcine erythrocytes, purchased from Calbiochem, was used in assay.
Residue:714
BDBM50326307
NameBDBM50326307
Synonyms:3-(Benzyloxycarbonyl-L-leucylamino)-N-(3-(4-methylpiperazin-1-yl)propyl)-2-oxophenylbutanamide | CHEMBL1240876
TypeSmall organic molecule
Emp. Form.C32H45N5O5
Mol. Mass.579.7302
SMILESCC(C)C[C@H](NC(=O)OCc1ccccc1)C(=O)NC(Cc1ccccc1)C(=O)C(=O)NCCCN1CCN(C)CC1