Reaction Details
TargetCalpain-1 catalytic subunit
LigandBDBM50326305
Substrate/Competitorn/a
Meas. Tech.ChEMBL_659958 (CHEMBL1247359)
Ki 711±n/a nM
Citation Ovat, ALi, ZZHampton, CYAsress, SAFernández, FMGlass, JDPowers, JC Peptidyl alpha-ketoamides with nucleobases, methylpiperazine, and dimethylaminoalkyl substituents as calpain inhibitors. J Med Chem53:6326-36 (2010) 
 
Calpain-1 catalytic subunit
Name:Calpain-1 catalytic subunit
Type:Catalytic subunit; forms a heterodimer with a small (regulatory) subunit (CAPNS1)
Mol. Mass.:81729.82
Organism:Sus scrofa (pig)
Description:Native calpain-1 from porcine erythrocytes, purchased from Calbiochem, was used in assay.
Residue:714
BDBM50326305
NameBDBM50326305
Synonyms:3-(Benzyloxycarbonyl-L-leucylamino)-N-(2-(dimethylamino)-ethyl)-2-oxopentanamide | CHEMBL1242933
TypeSmall organic molecule
Emp. Form.C28H38N4O5
Mol. Mass.510.6251
SMILESCC(C)C[C@H](NC(=O)OCc1ccccc1)C(=O)NC(Cc1ccccc1)C(=O)C(=O)NCCN(C)C