Reaction Details
TargetCalpain-1 catalytic subunit
LigandBDBM50326301
Substrate/Competitorn/a
Meas. Tech.ChEMBL_659958 (CHEMBL1247359)
Ki 480±n/a nM
Citation Ovat, ALi, ZZHampton, CYAsress, SAFernández, FMGlass, JDPowers, JC Peptidyl alpha-ketoamides with nucleobases, methylpiperazine, and dimethylaminoalkyl substituents as calpain inhibitors. J Med Chem53:6326-36 (2010) 
 
Calpain-1 catalytic subunit
Name:Calpain-1 catalytic subunit
Type:Catalytic subunit; forms a heterodimer with a small (regulatory) subunit (CAPNS1)
Mol. Mass.:81729.82
Organism:Sus scrofa (pig)
Description:Native calpain-1 from porcine erythrocytes, purchased from Calbiochem, was used in assay.
Residue:714
BDBM50326301
NameBDBM50326301
Synonyms:3-(Benzyloxycarbonyl-L-leucylamino)-N-(3-(4-amino-2-oxopyrimidin-1(2H)-yl)propyl))-2-oxophenylbutanamide | CHEMBL1240875
TypeSmall organic molecule
Emp. Form.C31H38N6O6
Mol. Mass.590.67
SMILESCC(C)C[C@H](NC(=O)OCc1ccccc1)C(=O)NC(Cc1ccccc1)C(=O)C(=O)NCCCn1ccc(N)nc1=O