Reaction Details
TargetEnoyl-acyl carrier reductase ENR
LigandBDBM50326328
Substrate/Competitorn/a
Meas. Tech.ChEMBL_657369 (CHEMBL1246345)
IC50>20000±n/a nM
Citation Tipparaju, SKMuench, SPMui, EJRuzheinikov, SNLu, JZHutson, SLKirisits, MJPrigge, STRoberts, CWHenriquez, FLKozikowski, APRice, DWMcLeod, RL Identification and development of novel inhibitors of Toxoplasma gondii enoyl reductase. J Med Chem53:6287-300 (2010) 
 
Enoyl-acyl carrier reductase ENR
Name:Enoyl-acyl carrier reductase ENR
Type:PROTEIN
Mol. Mass.:43663.67
Organism:Toxoplasma gondii
Description:ChEMBL_1290812
Residue:417
BDBM50326328
NameBDBM50326328
Synonyms:4-((4-(benzyloxy)-2-oxopyridin-1(2H)-yl)methyl)-3-chlorobenzonitrile | CHEMBL407894
TypeSmall organic molecule
Emp. Form.C20H15ClN2O2
Mol. Mass.350.798
SMILESClc1cc(ccc1Cn1ccc(OCc2ccccc2)cc1=O)C#N