Reaction Details
TargetS-methyl-5'-thioadenosine phosphorylase
LigandBDBM50326399
Substrate/Competitorn/a
Meas. Tech.ChEMBL_657428 (CHEMBL1246404)
Ki 0.8±n/a nM
Citation Longshaw, AIAdanitsch, FGutierrez, JAEvans, GBTyler, PCSchramm, VL Design and synthesis of potent"sulfur-free" transition state analogue inhibitors of 5'-methylthioadenosine nucleosidase and 5'-methylthioadenosine phosphorylase. J Med Chem53:6730-46 (2010) 
 
S-methyl-5'-thioadenosine phosphorylase
Name:S-methyl-5'-thioadenosine phosphorylase
Type:Enzyme
Mol. Mass.:31239.23
Organism:Homo sapiens (Human)
Description:n/a
Residue:283
BDBM50326399
NameBDBM50326399
Synonyms:(+/-)-trans-4-Butyl-1-[(9-deazaadenin-9-yl)methyl]-3-hydroxypyrrolidine CHEMBL1243249
TypeSmall organic molecule
Emp. Form.C15H23N5O
Mol. Mass.289.376
SMILESCCCC[C@H]1CN(Cc2c[nH]c3c(N)ncnc23)C[C@@H]1O