Reaction Details
TargetS-methyl-5'-thioadenosine phosphorylase
LigandBDBM50326405
Substrate/Competitorn/a
Meas. Tech.ChEMBL_657428 (CHEMBL1246404)
Ki 8±n/a nM
Citation Longshaw, AIAdanitsch, FGutierrez, JAEvans, GBTyler, PCSchramm, VL Design and synthesis of potent"sulfur-free" transition state analogue inhibitors of 5'-methylthioadenosine nucleosidase and 5'-methylthioadenosine phosphorylase. J Med Chem53:6730-46 (2010) 
 
S-methyl-5'-thioadenosine phosphorylase
Name:S-methyl-5'-thioadenosine phosphorylase
Type:Enzyme
Mol. Mass.:31239.23
Organism:Homo sapiens (Human)
Description:n/a
Residue:283
BDBM50326405
NameBDBM50326405
Synonyms:(+/-)-trans-1-[(9-Deazaadenin-9-yl)methyl]-3-hydroxy-4-phenylpyrrolidine | CHEMBL1243311
TypeSmall organic molecule
Emp. Form.C17H19N5O
Mol. Mass.309.3657
SMILESNc1ncnc2c(CN3C[C@H](O)[C@H](C3)c3ccccc3)c[nH]c12