Reaction Details
TargetS-methyl-5'-thioadenosine phosphorylase
LigandBDBM50326406
Substrate/Competitorn/a
Meas. Tech.ChEMBL_657428 (CHEMBL1246404)
Ki 3.2±n/a nM
Citation Longshaw, AIAdanitsch, FGutierrez, JAEvans, GBTyler, PCSchramm, VL Design and synthesis of potent"sulfur-free" transition state analogue inhibitors of 5'-methylthioadenosine nucleosidase and 5'-methylthioadenosine phosphorylase. J Med Chem53:6730-46 (2010) 
 
S-methyl-5'-thioadenosine phosphorylase
Name:S-methyl-5'-thioadenosine phosphorylase
Type:Enzyme
Mol. Mass.:31239.23
Organism:Homo sapiens (Human)
Description:n/a
Residue:283
BDBM50326406
NameBDBM50326406
Synonyms:(+/-)-trans-1-[(9-Deazaadenin-9-yl)methyl]-3-hydroxy-4-vinylpyrrolidine | CHEMBL1241381
TypeSmall organic molecule
Emp. Form.C13H17N5O
Mol. Mass.259.307
SMILESNc1ncnc2c(CN3C[C@H](O)[C@H](C3)C=C)c[nH]c12