Reaction Details
TargetMAP kinase-interacting serine/threonine-protein kinase 1
LigandBDBM50298223
Substrate/Competitorn/a
Meas. Tech.ChEMBL_657431 (CHEMBL1246407)
IC50 870±n/a nM
Citation Oyarzabal, JZarich, NAlbarran, MIPalacios, IUrbano-Cuadrado, MMateos, GReymundo, IRabal, OSalgado, ACorrionero, AFominaya, JPastor, JBischoff, JR Discovery of mitogen-activated protein kinase-interacting kinase 1 inhibitors by a comprehensive fragment-oriented virtual screening approach. J Med Chem53:6618-28 (2010) 
 
MAP kinase-interacting serine/threonine-protein kinase 1
Name:MAP kinase-interacting serine/threonine-protein kinase 1
Type:Serine/threonine-protein kinase
Mol. Mass.:51342.85
Organism:Homo sapiens (Human)
Description:Q9BUB5
Residue:465
BDBM50298223
NameBDBM50298223
Synonyms:CGP-57380 CHEMBL576817 | N-(4-fluorophenyl)-3H-pyrazolo[3,4-d]pyrimidine-3,4-diamine
TypeSmall organic molecule
Emp. Form.C11H9FN6
Mol. Mass.244.2278
SMILESNc1ncnc2n[nH]c(Nc3ccc(F)cc3)c12