Reaction Details
TargetMAP kinase-interacting serine/threonine-protein kinase 2
LigandBDBM27344
Substrate/Competitorn/a
Meas. Tech.ChEMBL_657433 (CHEMBL1246545)
IC50 171±n/a nM
Citation Oyarzabal, JZarich, NAlbarran, MIPalacios, IUrbano-Cuadrado, MMateos, GReymundo, IRabal, OSalgado, ACorrionero, AFominaya, JPastor, JBischoff, JR Discovery of mitogen-activated protein kinase-interacting kinase 1 inhibitors by a comprehensive fragment-oriented virtual screening approach. J Med Chem53:6618-28 (2010) 
 
MAP kinase-interacting serine/threonine-protein kinase 2
Name:MAP kinase-interacting serine/threonine-protein kinase 2
Type:Protein
Mol. Mass.:51870.79
Organism:Homo sapiens (Human)
Description:Q9HBH9
Residue:465
BDBM27344
NameBDBM27344
Synonyms:2-(pyridin-4-yl)-1H,4H,5H,6H,7H-pyrrolo[3,2-c]pyridin-4-one Pyrrolopyridinone, 1
TypeSmall organic molecule
Emp. Form.C12H11N3O
Mol. Mass.213.2352
SMILESO=C1NCCc2[nH]c(cc12)-c1ccncc1