Reaction Details
TargetSerine/threonine-protein kinase pim-1
LigandBDBM50326438
Substrate/Competitorn/a
Meas. Tech.ChEMBL_658036 (CHEMBL1248948)
IC50 18±n/a nM
Citation Akué-Gédu, RNauton, LThéry, VBain, JCohen, PAnizon, FMoreau, P Synthesis, Pim kinase inhibitory potencies and in vitro antiproliferative activities of diversely substituted pyrrolo[2,3-a]carbazoles. Bioorg Med Chem18:6865-73 (2010) 
 
Serine/threonine-protein kinase pim-1
Name:Serine/threonine-protein kinase pim-1
Type:Protein
Mol. Mass.:35681.82
Organism:Homo sapiens (Human)
Description:P11309
Residue:313
BDBM50326438
NameBDBM50326438
Synonyms:9-trifluoromethyl-1,10-dihydropyrrolo[2,3-a]carbazole-3-carbaldehyde | CHEMBL1243129
TypeSmall organic molecule
Emp. Form.C16H9F3N2O
Mol. Mass.302.2507
SMILESFC(F)(F)c1cccc2c1[nH]c1c2ccc2c(C=O)c[nH]c12