Reaction Details
TargetSerine/threonine-protein kinase pim-3
LigandBDBM50326441
Substrate/Competitorn/a
Meas. Tech.ChEMBL_657899 (CHEMBL1248423)
IC50 24±n/a nM
Citation Akué-Gédu, RNauton, LThéry, VBain, JCohen, PAnizon, FMoreau, P Synthesis, Pim kinase inhibitory potencies and in vitro antiproliferative activities of diversely substituted pyrrolo[2,3-a]carbazoles. Bioorg Med Chem18:6865-73 (2010) 
 
Serine/threonine-protein kinase pim-3
Name:Serine/threonine-protein kinase pim-3
Type:Protein
Mol. Mass.:35888.19
Organism:Homo sapiens (Human)
Description:Q86V86
Residue:326
BDBM50326441
NameBDBM50326441
Synonyms:9-Bromo-1,10-dihydropyrrolo[2,3-a]carbazole-3-carbaldehyde | CHEMBL1241009
TypeSmall organic molecule
Emp. Form.C15H9BrN2O
Mol. Mass.313.149
SMILESBrc1cccc2c1[nH]c1c2ccc2c(C=O)c[nH]c12