Reaction Details
TargetNADPH oxidase 4
LigandBDBM50326481
Substrate/Competitorn/a
Meas. Tech.ChEMBL_658093 (CHEMBL1249158)
IC50 1300±n/a nM
Citation Borbély, GSzabadkai, IHorváth, ZMarkó, PVarga, ZBreza, NBaska, FVántus, THuszár, MGeiszt, MHunyady, LBuday, LOrfi, LKéri, G Small-molecule inhibitors of NADPH oxidase 4. J Med Chem53:6758-62 (2010) 
 
NADPH oxidase 4
Name:NADPH oxidase 4
Type:PROTEIN
Mol. Mass.:66954.54
Organism:Homo sapiens (Human)
Description:ChEMBL_792879
Residue:578
BDBM50326481
NameBDBM50326481
Synonyms:CHEMBL1243188 | N1-(3-aminophenyl)-N2-(4-hydroxy-3-methoxyphenethyl)oxalamide
TypeSmall organic molecule
Emp. Form.C17H19N3O4
Mol. Mass.329.3505
SMILESCOc1cc(CCNC(=O)C(=O)Nc2cccc(N)c2)ccc1O