Reaction Details
TargetNADPH oxidase 4
LigandBDBM50326483
Substrate/Competitorn/a
Meas. Tech.ChEMBL_658093 (CHEMBL1249158)
IC50 740±n/a nM
Citation Borbély, GSzabadkai, IHorváth, ZMarkó, PVarga, ZBreza, NBaska, FVántus, THuszár, MGeiszt, MHunyady, LBuday, LOrfi, LKéri, G Small-molecule inhibitors of NADPH oxidase 4. J Med Chem53:6758-62 (2010) 
 
NADPH oxidase 4
Name:NADPH oxidase 4
Type:PROTEIN
Mol. Mass.:66954.54
Organism:Homo sapiens (Human)
Description:ChEMBL_792879
Residue:578
BDBM50326483
NameBDBM50326483
Synonyms:2-(3,4-dihydroxyphenyl)-3,7-dihydroxy-5-methoxy-4H-chromen-4-one | CHEMBL470848
TypeSmall organic molecule
Emp. Form.C16H12O7
Mol. Mass.316.2623
SMILESCOc1cc(O)cc2oc(-c3ccc(O)c(O)c3)c(O)c(=O)c12