Reaction Details
TargetNADPH oxidase 4
LigandBDBM50326489
Substrate/Competitorn/a
Meas. Tech.ChEMBL_658093 (CHEMBL1249158)
IC50 1130±n/a nM
Citation Borbély, GSzabadkai, IHorváth, ZMarkó, PVarga, ZBreza, NBaska, FVántus, THuszár, MGeiszt, MHunyady, LBuday, LOrfi, LKéri, G Small-molecule inhibitors of NADPH oxidase 4. J Med Chem53:6758-62 (2010) 
 
NADPH oxidase 4
Name:NADPH oxidase 4
Type:PROTEIN
Mol. Mass.:66954.54
Organism:Homo sapiens (Human)
Description:ChEMBL_792879
Residue:578
BDBM50326489
NameBDBM50326489
Synonyms:3-(3,4-dihydroxybenzylidene)-5-nitroindolin-2-one | CHEMBL1240559
TypeSmall organic molecule
Emp. Form.C15H10N2O5
Mol. Mass.298.2503
SMILESOc1ccc(\C=C2/C(=O)Nc3ccc(cc23)[N+]([O-])=O)cc1O