Reaction Details
TargetNADPH oxidase 4
LigandBDBM50326490
Substrate/Competitorn/a
Meas. Tech.ChEMBL_658093 (CHEMBL1249158)
IC50 1000±n/a nM
Citation Borbély, GSzabadkai, IHorváth, ZMarkó, PVarga, ZBreza, NBaska, FVántus, THuszár, MGeiszt, MHunyady, LBuday, LOrfi, LKéri, G Small-molecule inhibitors of NADPH oxidase 4. J Med Chem53:6758-62 (2010) 
 
NADPH oxidase 4
Name:NADPH oxidase 4
Type:PROTEIN
Mol. Mass.:66954.54
Organism:Homo sapiens (Human)
Description:ChEMBL_792879
Residue:578
BDBM50326490
NameBDBM50326490
Synonyms:1,1-diallyl-3-(5-hydroxy-4,6-dimethyl-2-oxoindolin-3-ylidene)thiourea | CHEMBL1243064
TypeSmall organic molecule
Emp. Form.C17H19N3O2S
Mol. Mass.329.417
SMILESCc1cc2NC(=O)C(=NC(=S)N(CC=C)CC=C)c2c(C)c1O