Reaction Details
TargetNADPH oxidase 4
LigandBDBM50043337
Substrate/Competitorn/a
Meas. Tech.ChEMBL_658093 (CHEMBL1249158)
IC50 960±n/a nM
Citation Borbély, GSzabadkai, IHorváth, ZMarkó, PVarga, ZBreza, NBaska, FVántus, THuszár, MGeiszt, MHunyady, LBuday, LOrfi, LKéri, G Small-molecule inhibitors of NADPH oxidase 4. J Med Chem53:6758-62 (2010) 
 
NADPH oxidase 4
Name:NADPH oxidase 4
Type:PROTEIN
Mol. Mass.:66954.54
Organism:Homo sapiens (Human)
Description:ChEMBL_792879
Residue:578
BDBM50043337
NameBDBM50043337
Synonyms:2-Hydroxy-5-(2-hydroxy-benzylamino)-benzoic acid | CHEMBL131407
TypeSmall organic molecule
Emp. Form.C14H13NO4
Mol. Mass.259.2573
SMILESOC(=O)c1cc(NCc2ccccc2O)ccc1O