Reaction Details
TargetNADPH oxidase 4
LigandBDBM50326494
Substrate/Competitorn/a
Meas. Tech.ChEMBL_658093 (CHEMBL1249158)
IC50 260±n/a nM
Citation Borbély, GSzabadkai, IHorváth, ZMarkó, PVarga, ZBreza, NBaska, FVántus, THuszár, MGeiszt, MHunyady, LBuday, LOrfi, LKéri, G Small-molecule inhibitors of NADPH oxidase 4. J Med Chem53:6758-62 (2010) 
 
NADPH oxidase 4
Name:NADPH oxidase 4
Type:PROTEIN
Mol. Mass.:66954.54
Organism:Homo sapiens (Human)
Description:ChEMBL_792879
Residue:578
BDBM50326494
NameBDBM50326494
Synonyms:2,3,8,9-tetrahydroxy-5-(3-nitrobenzyl)phenanthridin-6(5H)-one | CHEMBL1242942
TypeSmall organic molecule
Emp. Form.C20H14N2O7
Mol. Mass.394.3344
SMILESOc1cc2n(Cc3cccc(c3)[N+]([O-])=O)c(=O)c3cc(O)c(O)cc3c2cc1O