Reaction Details
TargetEpidermal growth factor receptor
LigandBDBM50326513
Substrate/Competitorn/a
Meas. Tech.ChEMBL_658253 (CHEMBL1246645)
IC50 8.12±n/a nM
Citation Pisaneschi, FNguyen, QDShamsaei, EGlaser, MRobins, EKaliszczak, MSmith, GSpivey, ACAboagye, EO Development of a new epidermal growth factor receptor positron emission tomography imaging agent based on the 3-cyanoquinoline core: synthesis and biological evaluation. Bioorg Med Chem18:6634-45 (2010) 
 
Epidermal growth factor receptor
Name:Epidermal growth factor receptor
Type:Receptor Kinase Domain
Mol. Mass.:134279.59
Organism:Homo sapiens (Human)
Description:P00533
Residue:1210
BDBM50326513
NameBDBM50326513
Synonyms:(E)-4-Methylamino-but-2-enoicacid[4-(3-chloro-4-fluorophenylamino)-3-cyano-7-(2-fluoroethoxy)-quinolin-6-yl]-amide | CHEMBL1243284
TypeSmall organic molecule
Emp. Form.C23H20ClF2N5O2
Mol. Mass.471.887
SMILESCNC\C=C\C(=O)Nc1cc2c(Nc3ccc(F)c(Cl)c3)c(cnc2cc1OCCF)C#N