Reaction Details
TargetEpidermal growth factor receptor
LigandBDBM3303
Substrate/Competitorn/a
Meas. Tech.ChEMBL_658253 (CHEMBL1246645)
IC50>1000±n/a nM
Citation Pisaneschi, FNguyen, QDShamsaei, EGlaser, MRobins, EKaliszczak, MSmith, GSpivey, ACAboagye, EO Development of a new epidermal growth factor receptor positron emission tomography imaging agent based on the 3-cyanoquinoline core: synthesis and biological evaluation. Bioorg Med Chem18:6634-45 (2010) 
 
Epidermal growth factor receptor
Name:Epidermal growth factor receptor
Type:Receptor Kinase Domain
Mol. Mass.:134279.59
Organism:Homo sapiens (Human)
Description:P00533
Residue:1210
BDBM3303
NameBDBM3303
Synonyms:4-Anilinoquinazoline deriv. 54 4[ (3-Bromophenyl)aminol-6,7-diaminoquinazoline | CHEMBL328216
TypeSmall organic molecule
Emp. Form.C14H12BrN5
Mol. Mass.330.183
SMILESNc1cc2ncnc(Nc3cccc(Br)c3)c2cc1N